[Date Prev][Date Next]   [Thread Prev][Thread Next]   [Thread Index] [Date Index] [Author Index]

Build failed in Jenkins: virt-manager -check » libvirt-fedora-rawhide #1931



See <https://ci.centos.org/job/virt-manager-check/systems=libvirt-fedora-rawhide/1931/display/redirect>

------------------------------------------
[...truncated 17.65 KB...]
--seclabel type=dynamic,label=012:345
--keywrap cipher0.name=aes,cipher0.state=on
--numatune 1-3,4,mode=strict,memnode0.cellid=1,memnode0.mode=strict,memnode0.nodeset=2
--memtune hard_limit=10,soft_limit=20,swap_hard_limit=30,min_guarantee=40
--blkiotune weight=100,device_path=/home/test/1.img,device_weight=200,read_bytes_sec=10000,write_bytes_sec=10000,read_iops_sec=20000,write_iops_sec=20000
--memorybacking size=1,unit='G',nodeset=0,1,nosharepages=yes,locked=yes,discard=yes,allocation.mode=immediate,access_mode=shared,source_type=file,hugepages.page.size=12,hugepages.page1.size=1234,hugepages.page1.unit=MB,hugepages.page1.nodeset=2
--features acpi=off,eoi=on,privnet=on,hyperv_synic=on,hyperv_reset=on,hyperv_spinlocks=on,hyperv_spinlocks_retries=5678,vmport=off,pmu=off,vmcoreinfo=on,kvm_hidden=off,hyperv_vapic=on
--clock offset=utc,hpet_present=no,rtc_tickpolicy=merge,timer2.name=hypervclock,timer3.name=pit,timer1.present=yes,timer3.tickpolicy=delay,timer2.present=no,timer4.name=rtc,timer5.name=tsc,timer6.name=tsc,timer4.track=wall,timer5.frequency=10,timer6.mode=emulate,timer7.name=rtc,timer7.tickpolicy=catchup,timer7.catchup.threshold=123,timer7.catchup.slew=120,timer7.catchup.limit=10000
--sysinfo type=smbios,bios_vendor="Acme LLC",bios_version=1.2.3,bios_date=01/01/1970,bios_release=10.22
--sysinfo type=smbios,system_manufacturer="Acme Inc.",system_product=Computer,system_version=3.2.1,system_serial=123456789,system_uuid=00000000-1111-2222-3333-444444444444,system_sku=abc-123,system_family=Server
--sysinfo type=smbios,baseBoard_manufacturer="Acme Corp.",baseBoard_product=Motherboard,baseBoard_version=A01,baseBoard_serial=1234-5678,baseBoard_asset=Tag,baseBoard_location=Chassis
--sysinfo type=smbios,chassis.manufacturer="Chassis Corp.",chassis.serial=1234chassis,chassis.asset=chasset,chassis.sku=chassku,chassis.version=4.0
--sysinfo type=smbios,oemStrings.entry2="complicated parsing, foo=bar",oemStrings.entry1=test1,oemStrings.entry0=test0
--pm suspend_to_mem=yes,suspend_to_disk=no
--resource partition=/virtualmachines/production
--events on_poweroff=destroy,on_reboot=restart,on_crash=preserve,on_lockfailure=ignore

--controller usb3
--controller scsi,model=virtio-scsi
--graphics vnc
--filesystem /foo/source,/bar/target
--memballoon virtio,autodeflate=on,stats.period=10
--watchdog ib700,action=pause
--tpm passthrough,model=tpm-crb,path=/dev/tpm0,backend.encryption.secret=11111111-2222-3333-4444-5555555555
--rng egd,backend_host=127.0.0.1,backend_service=8000,backend_type=udp,backend_mode=bind,backend_connect_host=foo,backend_connect_service=708,rate.bytes=1234,rate.period=1000,model=virtio
--panic iobase=0x506
  --ram 64 --print-step all
Error code : -1
Output was:
ERROR    Error: --cpu foobar,+x2apic,+x2apicagain,-distest,forbid=foo,forbid=bar,disable=distest2,optional=opttest,require=reqtest,match=strict,vendor=meee,mode=custom,cell.id=0,cell.cpus=1,2,3,cell.memory=1024,cell1.id=1,cell1.memory=256,cell1.cpus=5-8,numa.cell2.id=2,numa.cell2.memory=256,numa.cell2.cpus=4,cell0.distances.sibling0.id=0,cell0.distances.sibling0.value=10,cell0.distances.sibling1.id=1,cell0.distances.sibling1.value=21,numa.cell1.distances.sibling0.id=0,numa.cell1.distances.sibling0.value=21,cell1.distances.sibling1.id=1,cell1.distances.sibling1.value=10,cache.mode=emulate,cache.level=3: attrib must be dict, not NoneType


TESTSUITE: Expected command to pass, but it didn't.



======================================================================
FAIL: testCLI0019virt_install_cpu_disable_sec (tests.test_cli.CLITests)
----------------------------------------------------------------------
Traceback (most recent call last):
  File "<https://ci.centos.org/job/virt-manager-check/systems=libvirt-fedora-rawhide/ws/tests/test_cli.py";,> line 1462, in <lambda>
    return lambda s: cmdtemplate(s, cmd)
  File "<https://ci.centos.org/job/virt-manager-check/systems=libvirt-fedora-rawhide/ws/tests/test_cli.py";,> line 1461, in cmdtemplate
    _cmdobj.run(self)
  File "<https://ci.centos.org/job/virt-manager-check/systems=libvirt-fedora-rawhide/ws/tests/test_cli.py";,> line 352, in run
    tests.fail(err)
AssertionError: ./virt-install --hvm --nographics --noautoconsole --nodisks --pxe --connect __virtinst_test__test://<https://ci.centos.org/job/virt-manager-check/systems=libvirt-fedora-rawhide/ws/tests/testdriver.xml,predictable,fakeuri=qemu>:///system,domcaps=<https://ci.centos.org/job/virt-manager-check/systems=libvirt-fedora-rawhide/ws/tests/data/capabilities/kvm-x86_64-domcaps-q35.xml,caps=/home/jenkins/virt-manager/tests/data/capabilities/kvm-x86_64.xml> --cpu qemu64,secure=off  --ram 64 --print-step all
Command was: ./virt-install --hvm --nographics --noautoconsole --nodisks --pxe --connect __virtinst_test__test://<https://ci.centos.org/job/virt-manager-check/systems=libvirt-fedora-rawhide/ws/tests/testdriver.xml,predictable,fakeuri=qemu>:///system,domcaps=<https://ci.centos.org/job/virt-manager-check/systems=libvirt-fedora-rawhide/ws/tests/data/capabilities/kvm-x86_64-domcaps-q35.xml,caps=/home/jenkins/virt-manager/tests/data/capabilities/kvm-x86_64.xml> --cpu qemu64,secure=off  --ram 64 --print-step all
Error code : -1
Output was:
ERROR    Error: --cpu qemu64,secure=off: attrib must be dict, not NoneType


TESTSUITE: Expected command to pass, but it didn't.



======================================================================
FAIL: testCLI0020virt_install_cpu_rhel7_default (tests.test_cli.CLITests)
----------------------------------------------------------------------
Traceback (most recent call last):
  File "<https://ci.centos.org/job/virt-manager-check/systems=libvirt-fedora-rawhide/ws/tests/test_cli.py";,> line 1462, in <lambda>
    return lambda s: cmdtemplate(s, cmd)
  File "<https://ci.centos.org/job/virt-manager-check/systems=libvirt-fedora-rawhide/ws/tests/test_cli.py";,> line 1461, in cmdtemplate
    _cmdobj.run(self)
  File "<https://ci.centos.org/job/virt-manager-check/systems=libvirt-fedora-rawhide/ws/tests/test_cli.py";,> line 352, in run
    tests.fail(err)
AssertionError: ./virt-install --hvm --nographics --noautoconsole --nodisks --pxe --connect __virtinst_test__test://<https://ci.centos.org/job/virt-manager-check/systems=libvirt-fedora-rawhide/ws/tests/testdriver.xml,predictable,fakeuri=qemu>:///system,domcaps=<https://ci.centos.org/job/virt-manager-check/systems=libvirt-fedora-rawhide/ws/tests/data/capabilities/kvm-x86_64-rhel7-domcaps.xml,caps=/home/jenkins/virt-manager/tests/data/capabilities/kvm-x86_64-rhel7.xml>  --ram 64 --print-step all
Command was: ./virt-install --hvm --nographics --noautoconsole --nodisks --pxe --connect __virtinst_test__test://<https://ci.centos.org/job/virt-manager-check/systems=libvirt-fedora-rawhide/ws/tests/testdriver.xml,predictable,fakeuri=qemu>:///system,domcaps=<https://ci.centos.org/job/virt-manager-check/systems=libvirt-fedora-rawhide/ws/tests/data/capabilities/kvm-x86_64-rhel7-domcaps.xml,caps=/home/jenkins/virt-manager/tests/data/capabilities/kvm-x86_64-rhel7.xml>  --ram 64 --print-step all
Error code : -1
Output was:

Traceback (most recent call last):
  File "<https://ci.centos.org/job/virt-manager-check/systems=libvirt-fedora-rawhide/ws/tests/test_cli.py";,> line 228, in _launch_command
    ret = virtinstall.main(conn=conn)
  File "<https://ci.centos.org/job/virt-manager-check/systems=libvirt-fedora-rawhide/ws/virtinst/virtinstall.py";,> line 1051, in main
    guest, installer = build_guest_instance(conn, options)
  File "<https://ci.centos.org/job/virt-manager-check/systems=libvirt-fedora-rawhide/ws/virtinst/virtinstall.py";,> line 583, in build_guest_instance
    installer.set_install_defaults(guest)
  File "<https://ci.centos.org/job/virt-manager-check/systems=libvirt-fedora-rawhide/ws/virtinst/install/installer.py";,> line 411, in set_install_defaults
    guest.set_defaults(None)
  File "<https://ci.centos.org/job/virt-manager-check/systems=libvirt-fedora-rawhide/ws/virtinst/guest.py";,> line 728, in set_defaults
    self.cpu.set_defaults(self)
  File "<https://ci.centos.org/job/virt-manager-check/systems=libvirt-fedora-rawhide/ws/virtinst/domain/cpu.py";,> line 313, in set_defaults
    self._set_cpu_x86_kvm_default(guest)
  File "<https://ci.centos.org/job/virt-manager-check/systems=libvirt-fedora-rawhide/ws/virtinst/domain/cpu.py";,> line 293, in _set_cpu_x86_kvm_default
    self.set_special_mode(guest, mode)
  File "<https://ci.centos.org/job/virt-manager-check/systems=libvirt-fedora-rawhide/ws/virtinst/domain/cpu.py";,> line 108, in set_special_mode
    self.set_model(guest, self.conn.caps.host.cpu.model)
  File "<https://ci.centos.org/job/virt-manager-check/systems=libvirt-fedora-rawhide/ws/virtinst/domain/cpu.py";,> line 161, in set_model
    self._add_security_features(guest)
  File "<https://ci.centos.org/job/virt-manager-check/systems=libvirt-fedora-rawhide/ws/virtinst/domain/cpu.py";,> line 117, in _add_security_features
    for feature in domcaps.get_cpu_security_features():
  File "<https://ci.centos.org/job/virt-manager-check/systems=libvirt-fedora-rawhide/ws/virtinst/domcapabilities.py";,> line 320, in get_cpu_security_features
    self._features = self._lookup_cpu_security_features() or []
  File "<https://ci.centos.org/job/virt-manager-check/systems=libvirt-fedora-rawhide/ws/virtinst/domcapabilities.py";,> line 305, in _lookup_cpu_security_features
    cpu = self._get_expanded_cpu(m)
  File "<https://ci.centos.org/job/virt-manager-check/systems=libvirt-fedora-rawhide/ws/virtinst/domcapabilities.py";,> line 278, in _get_expanded_cpu
    cpuXML = self._convert_mode_to_cpu(mode.get_xml())
  File "<https://ci.centos.org/job/virt-manager-check/systems=libvirt-fedora-rawhide/ws/virtinst/domcapabilities.py";,> line 272, in _convert_mode_to_cpu
    root.attrib = None
TypeError: attrib must be dict, not NoneType


TESTSUITE: Expected command to pass, but it didn't.



======================================================================
FAIL: testCLI0175virt_install_qemu_plain (tests.test_cli.CLITests)
----------------------------------------------------------------------
Traceback (most recent call last):
  File "<https://ci.centos.org/job/virt-manager-check/systems=libvirt-fedora-rawhide/ws/tests/test_cli.py";,> line 1462, in <lambda>
    return lambda s: cmdtemplate(s, cmd)
  File "<https://ci.centos.org/job/virt-manager-check/systems=libvirt-fedora-rawhide/ws/tests/test_cli.py";,> line 1461, in cmdtemplate
    _cmdobj.run(self)
  File "<https://ci.centos.org/job/virt-manager-check/systems=libvirt-fedora-rawhide/ws/tests/test_cli.py";,> line 352, in run
    tests.fail(err)
AssertionError: ./virt-install --connect __virtinst_test__test://<https://ci.centos.org/job/virt-manager-check/systems=libvirt-fedora-rawhide/ws/tests/testdriver.xml,predictable,fakeuri=qemu>:///system,caps=<https://ci.centos.org/job/virt-manager-check/systems=libvirt-fedora-rawhide/ws/tests/data/capabilities/kvm-x86_64.xml,domcaps=/home/jenkins/virt-manager/tests/data/capabilities/kvm-x86_64-domcaps.xml> --autoconsole none --os-variant ubuntusaucy --nodisks --boot cdrom --virt-type qemu --cpu Penryn --input tablet --boot uefi --graphics vnc  --ram 64 --print-step all
Command was: ./virt-install --connect __virtinst_test__test://<https://ci.centos.org/job/virt-manager-check/systems=libvirt-fedora-rawhide/ws/tests/testdriver.xml,predictable,fakeuri=qemu>:///system,caps=<https://ci.centos.org/job/virt-manager-check/systems=libvirt-fedora-rawhide/ws/tests/data/capabilities/kvm-x86_64.xml,domcaps=/home/jenkins/virt-manager/tests/data/capabilities/kvm-x86_64-domcaps.xml> --autoconsole none --os-variant ubuntusaucy --nodisks --boot cdrom --virt-type qemu --cpu Penryn --input tablet --boot uefi --graphics vnc  --ram 64 --print-step all
Error code : -1
Output was:
ERROR    Error: --cpu Penryn: attrib must be dict, not NoneType


TESTSUITE: Expected command to pass, but it didn't.



======================================================================
FAIL: testCLI0217virt_install_aarch64_machvirt (tests.test_cli.CLITests)
----------------------------------------------------------------------
Traceback (most recent call last):
  File "<https://ci.centos.org/job/virt-manager-check/systems=libvirt-fedora-rawhide/ws/tests/test_cli.py";,> line 1462, in <lambda>
    return lambda s: cmdtemplate(s, cmd)
  File "<https://ci.centos.org/job/virt-manager-check/systems=libvirt-fedora-rawhide/ws/tests/test_cli.py";,> line 1461, in cmdtemplate
    _cmdobj.run(self)
  File "<https://ci.centos.org/job/virt-manager-check/systems=libvirt-fedora-rawhide/ws/tests/test_cli.py";,> line 352, in run
    tests.fail(err)
AssertionError: ./virt-install --connect __virtinst_test__test://<https://ci.centos.org/job/virt-manager-check/systems=libvirt-fedora-rawhide/ws/tests/testdriver.xml,predictable,fakeuri=qemu>:///system,caps=<https://ci.centos.org/job/virt-manager-check/systems=libvirt-fedora-rawhide/ws/tests/data/capabilities/kvm-x86_64.xml,domcaps=/home/jenkins/virt-manager/tests/data/capabilities/kvm-x86_64-domcaps.xml> --noautoconsole --arch aarch64 --machine virt --boot kernel=/f19-arm.kernel,initrd=/f19-arm.initrd,kernel_args="console=ttyAMA0,1234 rw root=/dev/vda3" --disk /dev/default-pool/testvol1.img  --ram 64 --print-step all
Command was: ./virt-install --connect __virtinst_test__test://<https://ci.centos.org/job/virt-manager-check/systems=libvirt-fedora-rawhide/ws/tests/testdriver.xml,predictable,fakeuri=qemu>:///system,caps=<https://ci.centos.org/job/virt-manager-check/systems=libvirt-fedora-rawhide/ws/tests/data/capabilities/kvm-x86_64.xml,domcaps=/home/jenkins/virt-manager/tests/data/capabilities/kvm-x86_64-domcaps.xml> --noautoconsole --arch aarch64 --machine virt --boot kernel=/f19-arm.kernel,initrd=/f19-arm.initrd,kernel_args="console=ttyAMA0,1234 rw root=/dev/vda3" --disk /dev/default-pool/testvol1.img  --ram 64 --print-step all
Error code : -1
Output was:

Traceback (most recent call last):
  File "<https://ci.centos.org/job/virt-manager-check/systems=libvirt-fedora-rawhide/ws/tests/test_cli.py";,> line 228, in _launch_command
    ret = virtinstall.main(conn=conn)
  File "<https://ci.centos.org/job/virt-manager-check/systems=libvirt-fedora-rawhide/ws/virtinst/virtinstall.py";,> line 1051, in main
    guest, installer = build_guest_instance(conn, options)
  File "<https://ci.centos.org/job/virt-manager-check/systems=libvirt-fedora-rawhide/ws/virtinst/virtinstall.py";,> line 583, in build_guest_instance
    installer.set_install_defaults(guest)
  File "<https://ci.centos.org/job/virt-manager-check/systems=libvirt-fedora-rawhide/ws/virtinst/install/installer.py";,> line 411, in set_install_defaults
    guest.set_defaults(None)
  File "<https://ci.centos.org/job/virt-manager-check/systems=libvirt-fedora-rawhide/ws/virtinst/guest.py";,> line 728, in set_defaults
    self.cpu.set_defaults(self)
  File "<https://ci.centos.org/job/virt-manager-check/systems=libvirt-fedora-rawhide/ws/virtinst/domain/cpu.py";,> line 310, in set_defaults
    self.set_model(guest, "cortex-a57")
  File "<https://ci.centos.org/job/virt-manager-check/systems=libvirt-fedora-rawhide/ws/virtinst/domain/cpu.py";,> line 161, in set_model
    self._add_security_features(guest)
  File "<https://ci.centos.org/job/virt-manager-check/systems=libvirt-fedora-rawhide/ws/virtinst/domain/cpu.py";,> line 117, in _add_security_features
    for feature in domcaps.get_cpu_security_features():
  File "<https://ci.centos.org/job/virt-manager-check/systems=libvirt-fedora-rawhide/ws/virtinst/domcapabilities.py";,> line 320, in get_cpu_security_features
    self._features = self._lookup_cpu_security_features() or []
  File "<https://ci.centos.org/job/virt-manager-check/systems=libvirt-fedora-rawhide/ws/virtinst/domcapabilities.py";,> line 305, in _lookup_cpu_security_features
    cpu = self._get_expanded_cpu(m)
  File "<https://ci.centos.org/job/virt-manager-check/systems=libvirt-fedora-rawhide/ws/virtinst/domcapabilities.py";,> line 278, in _get_expanded_cpu
    cpuXML = self._convert_mode_to_cpu(mode.get_xml())
  File "<https://ci.centos.org/job/virt-manager-check/systems=libvirt-fedora-rawhide/ws/virtinst/domcapabilities.py";,> line 272, in _convert_mode_to_cpu
    root.attrib = None
TypeError: attrib must be dict, not NoneType


TESTSUITE: Expected command to pass, but it didn't.



======================================================================
FAIL: testCLI0218virt_install_aarch64_machdefault (tests.test_cli.CLITests)
----------------------------------------------------------------------
Traceback (most recent call last):
  File "<https://ci.centos.org/job/virt-manager-check/systems=libvirt-fedora-rawhide/ws/tests/test_cli.py";,> line 1462, in <lambda>
    return lambda s: cmdtemplate(s, cmd)
  File "<https://ci.centos.org/job/virt-manager-check/systems=libvirt-fedora-rawhide/ws/tests/test_cli.py";,> line 1461, in cmdtemplate
    _cmdobj.run(self)
  File "<https://ci.centos.org/job/virt-manager-check/systems=libvirt-fedora-rawhide/ws/tests/test_cli.py";,> line 352, in run
    tests.fail(err)
AssertionError: ./virt-install --connect __virtinst_test__test://<https://ci.centos.org/job/virt-manager-check/systems=libvirt-fedora-rawhide/ws/tests/testdriver.xml,predictable,fakeuri=qemu>:///system,caps=<https://ci.centos.org/job/virt-manager-check/systems=libvirt-fedora-rawhide/ws/tests/data/capabilities/kvm-x86_64.xml,domcaps=/home/jenkins/virt-manager/tests/data/capabilities/kvm-x86_64-domcaps.xml> --noautoconsole --arch aarch64 --boot kernel=/f19-arm.kernel,initrd=/f19-arm.initrd,kernel_args="console=ttyAMA0,1234 rw root=/dev/vda3" --disk /dev/default-pool/testvol1.img  --ram 64 --print-step all
Command was: ./virt-install --connect __virtinst_test__test://<https://ci.centos.org/job/virt-manager-check/systems=libvirt-fedora-rawhide/ws/tests/testdriver.xml,predictable,fakeuri=qemu>:///system,caps=<https://ci.centos.org/job/virt-manager-check/systems=libvirt-fedora-rawhide/ws/tests/data/capabilities/kvm-x86_64.xml,domcaps=/home/jenkins/virt-manager/tests/data/capabilities/kvm-x86_64-domcaps.xml> --noautoconsole --arch aarch64 --boot kernel=/f19-arm.kernel,initrd=/f19-arm.initrd,kernel_args="console=ttyAMA0,1234 rw root=/dev/vda3" --disk /dev/default-pool/testvol1.img  --ram 64 --print-step all
Error code : -1
Output was:

Traceback (most recent call last):
  File "<https://ci.centos.org/job/virt-manager-check/systems=libvirt-fedora-rawhide/ws/tests/test_cli.py";,> line 228, in _launch_command
    ret = virtinstall.main(conn=conn)
  File "<https://ci.centos.org/job/virt-manager-check/systems=libvirt-fedora-rawhide/ws/virtinst/virtinstall.py";,> line 1051, in main
    guest, installer = build_guest_instance(conn, options)
  File "<https://ci.centos.org/job/virt-manager-check/systems=libvirt-fedora-rawhide/ws/virtinst/virtinstall.py";,> line 583, in build_guest_instance
    installer.set_install_defaults(guest)
  File "<https://ci.centos.org/job/virt-manager-check/systems=libvirt-fedora-rawhide/ws/virtinst/install/installer.py";,> line 411, in set_install_defaults
    guest.set_defaults(None)
  File "<https://ci.centos.org/job/virt-manager-check/systems=libvirt-fedora-rawhide/ws/virtinst/guest.py";,> line 728, in set_defaults
    self.cpu.set_defaults(self)
  File "<https://ci.centos.org/job/virt-manager-check/systems=libvirt-fedora-rawhide/ws/virtinst/domain/cpu.py";,> line 310, in set_defaults
    self.set_model(guest, "cortex-a57")
  File "<https://ci.centos.org/job/virt-manager-check/systems=libvirt-fedora-rawhide/ws/virtinst/domain/cpu.py";,> line 161, in set_model
    self._add_security_features(guest)
  File "<https://ci.centos.org/job/virt-manager-check/systems=libvirt-fedora-rawhide/ws/virtinst/domain/cpu.py";,> line 117, in _add_security_features
    for feature in domcaps.get_cpu_security_features():
  File "<https://ci.centos.org/job/virt-manager-check/systems=libvirt-fedora-rawhide/ws/virtinst/domcapabilities.py";,> line 320, in get_cpu_security_features
    self._features = self._lookup_cpu_security_features() or []
  File "<https://ci.centos.org/job/virt-manager-check/systems=libvirt-fedora-rawhide/ws/virtinst/domcapabilities.py";,> line 305, in _lookup_cpu_security_features
    cpu = self._get_expanded_cpu(m)
  File "<https://ci.centos.org/job/virt-manager-check/systems=libvirt-fedora-rawhide/ws/virtinst/domcapabilities.py";,> line 278, in _get_expanded_cpu
    cpuXML = self._convert_mode_to_cpu(mode.get_xml())
  File "<https://ci.centos.org/job/virt-manager-check/systems=libvirt-fedora-rawhide/ws/virtinst/domcapabilities.py";,> line 272, in _convert_mode_to_cpu
    root.attrib = None
TypeError: attrib must be dict, not NoneType


TESTSUITE: Expected command to pass, but it didn't.



======================================================================
FAIL: testCLI0364virt_xml_edit_cpu_host_copy (tests.test_cli.CLITests)
----------------------------------------------------------------------
Traceback (most recent call last):
  File "<https://ci.centos.org/job/virt-manager-check/systems=libvirt-fedora-rawhide/ws/tests/test_cli.py";,> line 1462, in <lambda>
    return lambda s: cmdtemplate(s, cmd)
  File "<https://ci.centos.org/job/virt-manager-check/systems=libvirt-fedora-rawhide/ws/tests/test_cli.py";,> line 1461, in cmdtemplate
    _cmdobj.run(self)
  File "<https://ci.centos.org/job/virt-manager-check/systems=libvirt-fedora-rawhide/ws/tests/test_cli.py";,> line 352, in run
    tests.fail(err)
AssertionError: ./virt-xml  --connect __virtinst_test__test://<https://ci.centos.org/job/virt-manager-check/systems=libvirt-fedora-rawhide/ws/tests/testdriver.xml,predictable,fakeuri=qemu>:///system,caps=<https://ci.centos.org/job/virt-manager-check/systems=libvirt-fedora-rawhide/ws/tests/data/capabilities/kvm-x86_64.xml,domcaps=/home/jenkins/virt-manager/tests/data/capabilities/kvm-x86_64-domcaps.xml> test-many-devices --edit --cpu host-copy 
Command was: ./virt-xml  --connect __virtinst_test__test://<https://ci.centos.org/job/virt-manager-check/systems=libvirt-fedora-rawhide/ws/tests/testdriver.xml,predictable,fakeuri=qemu>:///system,caps=<https://ci.centos.org/job/virt-manager-check/systems=libvirt-fedora-rawhide/ws/tests/data/capabilities/kvm-x86_64.xml,domcaps=/home/jenkins/virt-manager/tests/data/capabilities/kvm-x86_64-domcaps.xml> test-many-devices --edit --cpu host-copy 
Error code : -1
Output was:
ERROR    Error: --cpu host-copy: attrib must be dict, not NoneType


TESTSUITE: Expected command to pass, but it didn't.



----------------------------------------------------------------------
Ran 586 tests in 183.523s

FAILED (failures=8, errors=3, skipped=17)
Build step 'Execute shell' marked build as failure


[Date Prev][Date Next]   [Thread Prev][Thread Next]   [Thread Index] [Date Index] [Author Index]