[Date Prev][Date Next]   [Thread Prev][Thread Next]   [Thread Index] [Date Index] [Author Index]

Compile 0.80 error



0.79 Compiles fine on this box, when trying 0.80 I get the following

*** Building pam-unix module of the framework...

gcc -Wall -Wwrite-strings       -Wpointer-arith -Wcast-qual -Wcast-align        -Wstrict-prototypes -Wmissing-prototypes        -Wnested-externs -Winline -Wshadow -Dlinux -g -O2   -I./include -I/usr/src/redhat/BUILD/Linux-PAM-0.80/libpam/include -I/usr/src/redhat/BUILD/Linux-PAM-0.80 -I/usr/src/redhat/BUILD/Linux-PAM-0.80/libpamc/include  -fPIC  -D"USE_LCKPWDF"  -DCRACKLIB_DICTS=\"/usr/lib/cracklib_dict\" -DCHKPWD_HELPER=\"/sbin/unix_chkpwd\" -I../pammodutil/include  -DPAM_DYNAMIC   -c support.c -o dynamic/support.o
support.c: In function `_unix_run_helper_binary':
support.c:573: error: storage size of `rlim' isn't known
support.c:584: warning: implicit declaration of function `getrlimit'
support.c:584: error: `RLIMIT_NOFILE' undeclared (first use in this function)
support.c:584: error: (Each undeclared identifier is reported only once
support.c:584: error: for each function it appears in.)
support.c:573: warning: unused variable `rlim'
make[2]: *** [dynamic/support.o] Error 1
make[2]: Leaving directory `/usr/src/redhat/BUILD/Linux-PAM-0.80/modules/pam_unix'
make[1]: *** [all] Error 1
make[1]: Leaving directory `/usr/src/redhat/BUILD/Linux-PAM-0.80/modules'
make: *** [modules] Error 2
Bad exit status from /var/tmp/rpm-tmp.11215 (%build)

Dustin Butler
Intrcomm Technology


[Date Prev][Date Next]   [Thread Prev][Thread Next]   [Thread Index] [Date Index] [Author Index]