[Date Prev][Date Next]   [Thread Prev][Thread Next]   [Thread Index] [Date Index] [Author Index]

Report nptl 0.56



Hi

Building on:-

i686-pc-linux-gnu
linux-2.6.0-test2

Tools used:-

FSF gcc-3.3.1-cvs
HJL binutils-2.14.90.0.5

The testsuite fails a few tests for me:-

make[2]: *** [/mnt/hdb6/home/gws/scratch/tempo/glibc-build/nptl/tst-kill1.out] Error 1
make[2]: *** [/mnt/hdb6/home/gws/scratch/tempo/glibc-build/nptl/tst-join1.out] Error 1
make[2]: *** [/mnt/hdb6/home/gws/scratch/tempo/glibc-build/nptl/tst-fork3.out] Terminated
make[2]: *** Deleting file `/mnt/hdb6/home/gws/scratch/tempo/glibc-build/nptl/tst-fork3.out'
make[2]: *** [/mnt/hdb6/home/gws/scratch/tempo/glibc-build/nptl/tst-exec3.out] Error 1
make[2]: *** [/mnt/hdb6/home/gws/scratch/tempo/glibc-build/nptl/tst-exec4.out] Error 1
make[2]: *** [/mnt/hdb6/home/gws/scratch/tempo/glibc-build/nptl/tst-exit1.out] Error 1

tst-fork3 sometimes works, sometimes doesn't. On this occasion I manually
killed it to keep the testsuite running.

The 2.6.0-test2 kernel also throws up a couple of oops's during the
testsuite run which I've reported separately to the kernel folk. Maybe the
kernel is responsible for the above failures. Dunno.

Anyway, hope this is useful.

Thanks
Greg




[Date Prev][Date Next]   [Thread Prev][Thread Next]   [Thread Index] [Date Index] [Author Index]