[Date Prev][Date Next]   [Thread Prev][Thread Next]   [Thread Index] [Date Index] [Author Index]

[rdo-infra-list] Build failed in Jenkins: weirdo-stable-mitaka #3



https://ci.centos.org/job/weirdo-stable-mitaka/3/------------------------------------------
Started by user RDO Project
[EnvInject] - Loading node environment variables.
Building remotely on rdo-ci-cloudslave01 (rdo rdo-dev) in workspace <https://ci.centos.org/job/weirdo-stable-mitaka/ws/>
[WS-CLEANUP] Deleting project workspace...
[WS-CLEANUP] Done
[weirdo-stable-mitaka] $ /bin/bash /tmp/hudson2080988096619995204.sh
+===============================================+
| Scheduling jobs to test:
|   - release_rpm: centos-release-openstack-mitaka
|   - version: stable/mitaka
|   - openstack_release: mitaka
+===============================================+
Waiting for the completion of weirdo-generic-puppet-openstack-scenario001
weirdo-generic-puppet-openstack-scenario001 #81 completed. Result was FAILURE
Waiting for the completion of weirdo-generic-puppet-openstack-scenario002
weirdo-generic-puppet-openstack-scenario002 #66 completed. Result was SUCCESS
Waiting for the completion of weirdo-generic-puppet-openstack-scenario003
weirdo-generic-puppet-openstack-scenario003 #64 completed. Result was SUCCESS
Waiting for the completion of weirdo-generic-packstack-scenario001
weirdo-generic-packstack-scenario001 #54 completed. Result was FAILURE
Waiting for the completion of weirdo-generic-packstack-scenario002
weirdo-generic-packstack-scenario002 #74 completed. Result was FAILURE
Waiting for the completion of weirdo-generic-packstack-scenario003
weirdo-generic-packstack-scenario003 #49 completed. Result was FAILURE
Build step 'Trigger/call builds on other projects' marked build as failure


[Date Prev][Date Next]   [Thread Prev][Thread Next]   [Thread Index] [Date Index] [Author Index]