[Date Prev][Date Next]   [Thread Prev][Thread Next]   [Thread Index] [Date Index] [Author Index]

Problem compiling tux3-2.6.8.1-A4 (x86_64)



Hi all

I am currently running FC2 with kernel 2.6.8.1 x86_64

I applied tux3-2.6.8.1-A4 to a fresh linux-2.6.8.1
source tree and tried compiling the kernel but I get
an error. 

Here is the sequence of events:

make bzImage succeeds
make modules fails with this some warnings and
ultimate with error:

net/tux/accept.c: In function `kmalloc_req':
net/tux/accept.c:150: warning: int format, different
type arg (arg 4)
net/tux/accept.c:150: warning: int format, different
type arg (arg 4)
  CC [M]  net/tux/input.o
  CC [M]  net/tux/userspace.o
  CC [M]  net/tux/cachemiss.o
  CC [M]  net/tux/output.o
  CC [M]  net/tux/redirect.o
  CC [M]  net/tux/postpone.o
  CC [M]  net/tux/logger.o
net/tux/logger.c: In function `writeout_log':
net/tux/logger.c:741: error: structure has no member
named `f_last_index'
net/tux/logger.c:742: error: structure has no member
named `f_last_index'
make[2]: *** [net/tux/logger.o] Error 1
make[1]: *** [net/tux] Error 2
make: *** [net] Error 2

Has anyone seen this error or can shed some light? 

Much appreciated
John



		
_______________________________
Do you Yahoo!?
Declare Yourself - Register online to vote today!
http://vote.yahoo.com



[Date Prev][Date Next]   [Thread Prev][Thread Next]   [Thread Index] [Date Index] [Author Index]