[Date Prev][Date Next]   [Thread Prev][Thread Next]   [Thread Index] [Date Index] [Author Index]

kernel compilation 2.4.2-0.1.49 fails



[root birrella linux-2.4]# rpm -qa |grep kernel
kernel-2.4.2-0.1.49
kernel-headers-2.4.2-0.1.49
kernel-source-2.4.2-0.1.49

[root birrella linux-2.4]# rpm -q gcc
gcc-2.96-80

Compilation fails here (contact me if you need the complete .config): 
make[1]: Entering directory `/usr/src/linux-2.4.2/fs'
make -C nls modules
make[2]: Entering directory `/usr/src/linux-2.4.2/fs/nls'
gcc -D__KERNEL__ -I/usr/src/linux-2.4/include -Wall -Wstrict-prototypes -O2 
-fomit-frame-pointer -fno-strict-aliasing -fno-common -Wno-unused
-pipe -mpreferred-stack-boundary=2 -march=i686 -DMODULE -DMODVERSIONS 
-include /usr/src/linux-2.4/include/linux/modversions.h   -c -o nls_cp437.o 
nls_cp437.c
In file included from nls_cp437.c:10:
/usr/src/linux-2.4/include/linux/module.h:173: nondigits in number and not 
hexadecimal
/usr/src/linux-2.4/include/linux/module.h:173: nondigits in number and not 
hexadecimal
/usr/src/linux-2.4/include/linux/module.h:173: nondigits in number and not 
hexadecimal
/usr/src/linux-2.4/include/linux/module.h:173: nondigits in number and not 
hexadecimal
/usr/src/linux-2.4/include/linux/module.h:173: parse error before `62dada05'
/usr/src/linux-2.4/include/linux/module.h:173: 
`inter_module_register_R_ver_str' declared as function returning a function
/usr/src/linux-2.4/include/linux/module.h:173: warning: function declaration 
isn't a prototype
/usr/src/linux-2.4/include/linux/module.h:174: nondigits in number and not 
hexadecimal
/usr/src/linux-2.4/include/linux/module.h:174: missing white space after 
number `7a9e845'
/usr/src/linux-2.4/include/linux/module.h:174: parse error before `7a9e845'
/usr/src/linux-2.4/include/linux/module.h:174: 
`inter_module_unregister_R_ver_str' declared as function returning a function
/usr/src/linux-2.4/include/linux/module.h:174: warning: function declaration 
isn't a prototype
/usr/src/linux-2.4/include/linux/module.h:175: `inter_module_get_R_ver_str' 
declared as function returning a function
/usr/src/linux-2.4/include/linux/module.h:175: warning: parameter names 
(without types) in function declaration
/usr/src/linux-2.4/include/linux/module.h:176: 
`inter_module_get_request_R_ver_str' declared as function returning a function
/usr/src/linux-2.4/include/linux/module.h:176: warning: parameter names 
(without types) in function declaration
/usr/src/linux-2.4/include/linux/module.h:177: nondigits in number and not 
hexadecimal
/usr/src/linux-2.4/include/linux/module.h:177: nondigits in number and not 
hexadecimal
/usr/src/linux-2.4/include/linux/module.h:177: nondigits in number and not 
hexadecimal
/usr/src/linux-2.4/include/linux/module.h:177: parse error before `6b99f7d8'
/usr/src/linux-2.4/include/linux/module.h:177: `inter_module_put_R_ver_str' 
declared as function returning a function
/usr/src/linux-2.4/include/linux/module.h:177: warning: function declaration 
isn't a prototype
/usr/src/linux-2.4/include/linux/module.h:186: `try_inc_mod_count_R_ver_str' 
declared as function returning a function
/usr/src/linux-2.4/include/linux/module.h:186: warning: parameter names 
(without types) in function declaration
make[2]: *** [nls_cp437.o] Error 1
make[2]: Leaving directory `/usr/src/linux-2.4.2/fs/nls'
make[1]: *** [_modsubdir_nls] Error 2
make[1]: Leaving directory `/usr/src/linux-2.4.2/fs'
make: *** [_mod_fs] Error 2
-- 
Computers are like airconditioners: 
                      They stop working properly if you open windows.





[Date Prev][Date Next]   [Thread Prev][Thread Next]   [Thread Index] [Date Index] [Author Index]